{"text_format":"3","workbook":"xlsx","n_sheets":8,"sheets":["Rennen 1","Rennen 2","Rennen 3","Rennen 4","Rennen 5","Einzelauswertung","Meisterschaftspunkte","AUSWERTUNG RENNEN"],"not_rendered":{"charts":2,"macros":1,"defined_names":1},"unopened":[{"sheet":"Meisterschaftspunkte","index":6,"reason":"not_a_worksheet"}],"read":"whole","date_system":"1900"}

{"sheet":"Rennen 1","index":0,"n_rows":13,"n_cols":10,"rows_kept":13}
["Rennnstatistik","2015-04-25"]
[]
["Name","Beste \nRundenzeit","Bestzeit in\nRunde","Mittlere\nRundenzeit","Gesamt-\nfahrzeit","Mittlere\nGeschwindigkeit","Runden","Zusatzgewicht","Platzierung","Punkte"]
["Marcel",26.32,71,26.62,"00:35:02",42.61,79,0,1,{"$f":"IF(I4=1,10,IF(I4=2,8,IF(I4=3,6,IF(I4=4,5,IF(I4=5,4,IF(I4=6,3,IF(I4=7,2,IF(I4=8,1,0))))))))","v":10}]
["Sebastian",26.78,76,27.35,"00:35:06",41.46,77,0,2,{"$f":"IF(I5=1,10,IF(I5=2,8,IF(I5=3,6,IF(I5=4,5,IF(I5=5,4,IF(I5=6,3,IF(I5=7,2,IF(I5=8,1,0))))))))","v":8}]
["Thomas",26.82,9,{"v":27.4,"d":"27.40"},"00:35:11",41.38,77,0,3,6]
["Simon",27.04,30,27.83,"00:35:17",40.75,76,0,4,5]
["Siegfried",27.19,6,27.87,"00:35:19",40.68,76,0,5,4]
["Christian",27.74,15,28.66,"00:35:23",39.57,74,0,6,3]
["Richard",27.97,null,29.58,"00:35:03",38.33,71,0,7,2]
["Anna",{"$nulls":8},0]
["Carlos",{"$nulls":8},0]
["Jens",{"$nulls":8},0]

{"sheet":"Rennen 2","index":1,"n_rows":13,"n_cols":10,"rows_kept":13}
["Rennnstatistik","2015-05-30"]
[]
["Name","Beste \nRundenzeit","Bestzeit in\nRunde","Mittlere\nRundenzeit","Gesamt-\nfahrzeit","Mittlere\nGeschwindigkeit","Runden","Zusatzgewicht","Platzierung","Punkte"]
["Marcel",26.98,63,27.28,1.6666666666666667,41.57,88,30,1,{"$f":"IF(I4=1,10,IF(I4=2,8,IF(I4=3,6,IF(I4=4,5,IF(I4=5,4,IF(I4=6,3,IF(I4=7,2,IF(I4=8,1,0))))))))","v":10}]
["Sebastian",27.49,5,28.05,1.6756944444444446,40.43,86,20,3,{"$f":"IF(I5=1,10,IF(I5=2,8,IF(I5=3,6,IF(I5=4,5,IF(I5=5,4,IF(I5=6,3,IF(I5=7,2,IF(I5=8,1,0))))))))","v":6}]
["Thomas",26.94,62,27.4,1.6756944444444446,41.39,88,10,2,8]
["Simon",27.12,18,28.05,1.6756944444444446,40.42,86,null,4,5]
["Siegfried",27.29,46,28.06,1.676388888888889,40.42,86,null,"S5",0]
["Christian",27.68,8,28.59,1.66875,39.67,84,null,7,2]
["Richard",27.81,7,28.74,1.6791666666666665,39.46,84,null,-9,0]
["Anna",27.92,21,29.53,1.6013888888888888,{"v":38.4,"d":"38.40"},78,null,10,0]
["Carlos",27.6,69,null,1.6743055555555555,39.56,84,null,8,1]
["Jens",27.32,23,28.58,1.6881944444444443,39.68,85,null,6,3]

{"sheet":"Rennen 3","index":2,"n_rows":13,"n_cols":10,"rows_kept":13}
["Rennnstatistik","2015-06-20"]
[]
["Name","Beste \nRundenzeit","Bestzeit in\nRunde","Mittlere\nRundenzeit","Gesamt-\nfahrzeit","Mittlere\nGeschwindigkeit","Runden","Zusatzgewicht","Platzierung","Punkte"]
["Marcel",27.07,33,{"v":28,"d":"28.00 s"},"00:30:20",40.5,65,30,1,{"$f":"IF(I4=1,10,IF(I4=2,8,IF(I4=3,6,IF(I4=4,5,IF(I4=5,4,IF(I4=6,3,IF(I4=7,2,IF(I4=8,1,0))))))))","v":10}]
["Sebastian",27.16,55,{"v":28.1,"d":"28.10 s"},"00:30:28",40.35,65,20,4,{"$f":"IF(I5=1,10,IF(I5=2,8,IF(I5=3,6,IF(I5=4,5,IF(I5=5,4,IF(I5=6,3,IF(I5=7,2,IF(I5=8,1,0))))))))","v":5}]
["Thomas",27.24,24,{"v":28.1,"d":"28.10 s"},"00:30:28",40.63,65,20,-5,0]
["Simon",27.04,45,{"v":28.02,"d":"28.02 s"},"00:30:22",40.47,65,null,2,8]
["Siegfried",26.89,19,{"v":28.02,"d":"28.02 s"},"00:30:22",40.47,65,null,3,6]
["Christian",27.81,42,{"v":28.93,"d":"28.93 s"},"00:30:25",39.25,63,null,7,2]
["Richard",27.78,35,{"v":29.16,"d":"29.16 s"},"00:30:40",38.88,63,null,8,1]
["Anna",{"$nulls":8},0]
["Carlos",{"$nulls":8},0]
["Jens",27.45,64,{"v":28.5,"d":"28.50 s"},"00:30:26",39.79,64,null,6,3]

{"sheet":"Rennen 4","index":3,"n_rows":13,"n_cols":10,"rows_kept":13}
["Rennnstatistik","2015-09-26"]
[]
["Name","Beste \nRundenzeit","Bestzeit in\nRunde","Mittlere\nRundenzeit","Gesamt-\nfahrzeit","Mittlere\nGeschwindigkeit","Runden","Zusatzgewicht","Platzierung","Punkte"]
["Marcel",26.99,60,27.25,0.02460648148148148,41.61,78,30,1,{"$f":"IF(I4=1,10,IF(I4=2,8,IF(I4=3,6,IF(I4=4,5,IF(I4=5,4,IF(I4=6,3,IF(I4=7,2,IF(I4=8,1,0))))))))","v":10}]
["Sebastian",27.15,51,27.55,0.02487268518518519,41.16,78,20,2,{"$f":"IF(I5=1,10,IF(I5=2,8,IF(I5=3,6,IF(I5=4,5,IF(I5=5,4,IF(I5=6,3,IF(I5=7,2,IF(I5=8,1,0))))))))","v":8}]
["Thomas",27.09,37,27.54,"00:35:50",41.18,78,10,3,6]
["Simon",{"$nulls":6},10,null,0]
["Siegfried",27.37,22,27.79,0.02479166666666667,40.81,77,null,4,5]
["Christian",27.72,24,28.22,0.024861111111111108,40.18,76,null,5,4]
["Richard",27.86,64,28.77,0.024652777777777777,39.41,74,null,7,2]
["Anna",{"$nulls":8},0]
["Carlos",27.72,54,28.57,"00:35:45",39.7,75,null,6,3]
["Jens",{"$nulls":8},0]

{"sheet":"Rennen 5","index":4,"n_rows":14,"n_cols":10,"rows_kept":14}
["Rennnstatistik","2015-10-24"]
[]
["Name","Beste \nRundenzeit","Bestzeit in\nRunde","Mittlere\nRundenzeit","Gesamt-\nfahrzeit","Mittlere\nGeschwindigkeit","Runden","Zusatzgewicht","Platzierung","Punkte"]
["Marcel",27.078,55,27.302,null,null,66,30,-1,{"$f":"IF(I4=1,10,IF(I4=2,8,IF(I4=3,6,IF(I4=4,5,IF(I4=5,4,IF(I4=6,3,IF(I4=7,2,IF(I4=8,1,0))))))))","v":0}]
["Sebastian",{"$nulls":6},20,null,{"$f":"IF(I5=1,10,IF(I5=2,8,IF(I5=3,6,IF(I5=4,5,IF(I5=5,4,IF(I5=6,3,IF(I5=7,2,IF(I5=8,1,0))))))))","v":0}]
["Thomas",27.323,46,27.61,null,null,66,10,4,5]
["Simon",27.063,49,27.492,null,null,66,null,3,6]
["Siegfried",27.194,60,27.484,null,null,66,null,2,8]
["Christian",27.641,50,28.063,null,null,64,null,-8,0]
["Richard",27.441,30,27.881,null,null,65,null,5,4]
["Anna",28.02,11,29.703,null,null,51,null,9,0]
["Carlos",27.54,42,28.038,null,null,65,null,6,3]
["Jens",27.49,64,27.969,null,null,64,null,7,2]
["Mateo",27.845,11,29.703,null,null,63,null,9,0]

{"sheet":"Einzelauswertung","index":5,"n_rows":13,"n_cols":10,"rows_kept":13,"merged":[[3,0,3,2],[12,2,13,2],[12,4,13,4],[12,9,13,9]]}
[]
[]
[]
["Simon"]
[null,"Beste \nRundenzeit","Bestzeit in\nRunde","Mittlere\nRundenzeit","Gesamt-\nfahrzeit","Mittlere\nGeschwindigkeit","Runden","Zusatzgewicht","Platzierung","Punkte"]
["Rennen 1",{"$f":"IF(SUMIF('Rennen 1'!$A$4:$J$13,$A$4,'Rennen 1'!$B$4:$B$13)=0,\"\",SUMIF('Rennen 1'!$A$4:$J$13,$A$4,'Rennen 1'!$B$4:$B$13))","v":27.04},{"$f":"IF(SUMIF('Rennen 1'!$A$4:$J$13,$A$4,'Rennen 1'!$C$4:$C$13)=0,\"\",SUMIF('Rennen 1'!$A$4:$J$13,$A$4,'Rennen 1'!$C$4:$C$13))","v":30},{"$f":"IF(SUMIF('Rennen 1'!$A$4:$J$13,$A$4,'Rennen 1'!$D$4:$D$13)=0,\"\",SUMIF('Rennen 1'!$A$4:$J$13,$A$4,'Rennen 1'!$D$4:$D$13))","v":27.83},{"$f":"IF(SUMIF('Rennen 1'!$A$4:$J$13,$A$4,'Rennen 1'!$E$4:$E$13)=0,\"\",SUMIF('Rennen 1'!$A$4:$J$13,$A$4,'Rennen 1'!$E$4:$E$13))","v":"00:35:17"},{"$f":"IF(SUMIF('Rennen 1'!$A$4:$J$13,$A$4,'Rennen 1'!$F$4:$F$13)=0,\"\",SUMIF('Rennen 1'!$A$4:$J$13,$A$4,'Rennen 1'!$F$4:$F$13))","v":40.75},{"$f":"IF(SUMIF('Rennen 1'!$A$4:$J$13,$A$4,'Rennen 1'!$G$4:$G$13)=0,\"\",SUMIF('Rennen 1'!$A$4:$J$13,$A$4,'Rennen 1'!$G$4:$G$13))","v":76},{"$f":"IF(SUMIF('Rennen 1'!$A$4:$J$13,$A$4,'Rennen 1'!$H$4:$H$13)=0,\"\",SUMIF('Rennen 1'!$A$4:$J$13,$A$4,'Rennen 1'!$H$4:$H$13))","v":""},{"$f":"IF(SUMIF('Rennen 1'!$A$4:$J$13,$A$4,'Rennen 1'!$I$4:$I$13)=0,\"\",SUMIF('Rennen 1'!$A$4:$J$13,$A$4,'Rennen 1'!$I$4:$I$13))","v":4},{"$f":"IF(SUMIF('Rennen 1'!$A$4:$J$13,$A$4,'Rennen 1'!$J$4:$J$13)=0,\"\",SUMIF('Rennen 1'!$A$4:$J$13,$A$4,'Rennen 1'!$J$4:$J$13))","v":5}]
["Rennen 2",{"$f":"IF(SUMIF('Rennen 2'!$A$4:$J$13,$A$4,'Rennen 2'!$B$4:$B$13)=0,\"\",SUMIF('Rennen 2'!$A$4:$J$13,$A$4,'Rennen 2'!$B$4:$B$13))","v":27.12},{"$f":"IF(SUMIF('Rennen 2'!$A$4:$J$13,$A$4,'Rennen 2'!$C$4:$C$13)=0,\"\",SUMIF('Rennen 2'!$A$4:$J$13,$A$4,'Rennen 2'!$C$4:$C$13))","v":18},{"$f":"IF(SUMIF('Rennen 2'!$A$4:$J$13,$A$4,'Rennen 2'!$D$4:$D$13)=0,\"\",SUMIF('Rennen 2'!$A$4:$J$13,$A$4,'Rennen 2'!$D$4:$D$13))","v":28.05},{"$f":"IF(SUMIF('Rennen 2'!$A$4:$J$13,$A$4,'Rennen 2'!$E$4:$E$13)=0,\"\",SUMIF('Rennen 2'!$A$4:$J$13,$A$4,'Rennen 2'!$E$4:$E$13))","v":1.6756944444444446},{"$f":"IF(SUMIF('Rennen 2'!$A$4:$J$13,$A$4,'Rennen 2'!$F$4:$F$13)=0,\"\",SUMIF('Rennen 2'!$A$4:$J$13,$A$4,'Rennen 2'!$F$4:$F$13))","v":40.42},{"$f":"IF(SUMIF('Rennen 2'!$A$4:$J$13,$A$4,'Rennen 2'!$G$4:$G$13)=0,\"\",SUMIF('Rennen 2'!$A$4:$J$13,$A$4,'Rennen 2'!$G$4:$G$13))","v":86},{"$f":"IF(SUMIF('Rennen 2'!$A$4:$J$13,$A$4,'Rennen 2'!$H$4:$H$13)=0,\"\",SUMIF('Rennen 2'!$A$4:$J$13,$A$4,'Rennen 2'!$H$4:$H$13))","v":""},{"$f":"IF(SUMIF('Rennen 2'!$A$4:$J$13,$A$4,'Rennen 2'!$I$4:$I$13)=0,\"\",SUMIF('Rennen 2'!$A$4:$J$13,$A$4,'Rennen 2'!$I$4:$I$13))","v":4},{"$f":"IF(SUMIF('Rennen 2'!$A$4:$J$13,$A$4,'Rennen 2'!$J$4:$J$13)=0,\"\",SUMIF('Rennen 2'!$A$4:$J$13,$A$4,'Rennen 2'!$J$4:$J$13))","v":5}]
["Rennen 3",{"$f":"IF(SUMIF('Rennen 3'!$A$4:$J$13,$A$4,'Rennen 3'!$B$4:$B$13)=0,\"\",SUMIF('Rennen 3'!$A$4:$J$13,$A$4,'Rennen 3'!$B$4:$B$13))","v":27.04},{"$f":"IF(SUMIF('Rennen 3'!$A$4:$J$13,$A$4,'Rennen 3'!$C$4:$C$13)=0,\"\",SUMIF('Rennen 3'!$A$4:$J$13,$A$4,'Rennen 3'!$C$4:$C$13))","v":45},{"$f":"IF(SUMIF('Rennen 3'!$A$4:$J$13,$A$4,'Rennen 3'!$D$4:$D$13)=0,\"\",SUMIF('Rennen 3'!$A$4:$J$13,$A$4,'Rennen 3'!$D$4:$D$13))","v":28.02},{"$f":"IF(SUMIF('Rennen 3'!$A$4:$J$13,$A$4,'Rennen 3'!$E$4:$E$13)=0,\"\",SUMIF('Rennen 3'!$A$4:$J$13,$A$4,'Rennen 3'!$E$4:$E$13))","v":"00:30:22"},{"$f":"IF(SUMIF('Rennen 3'!$A$4:$J$13,$A$4,'Rennen 3'!$F$4:$F$13)=0,\"\",SUMIF('Rennen 3'!$A$4:$J$13,$A$4,'Rennen 3'!$F$4:$F$13))","v":40.47},{"$f":"IF(SUMIF('Rennen 3'!$A$4:$J$13,$A$4,'Rennen 3'!$G$4:$G$13)=0,\"\",SUMIF('Rennen 3'!$A$4:$J$13,$A$4,'Rennen 3'!$G$4:$G$13))","v":65},{"$f":"IF(SUMIF('Rennen 3'!$A$4:$J$13,$A$4,'Rennen 3'!$H$4:$H$13)=0,\"\",SUMIF('Rennen 3'!$A$4:$J$13,$A$4,'Rennen 3'!$H$4:$H$13))","v":""},{"$f":"IF(SUMIF('Rennen 3'!$A$4:$J$13,$A$4,'Rennen 3'!$I$4:$I$13)=0,\"\",SUMIF('Rennen 3'!$A$4:$J$13,$A$4,'Rennen 3'!$I$4:$I$13))","v":2},{"$f":"IF(SUMIF('Rennen 3'!$A$4:$J$13,$A$4,'Rennen 3'!$J$4:$J$13)=0,\"\",SUMIF('Rennen 3'!$A$4:$J$13,$A$4,'Rennen 3'!$J$4:$J$13))","v":8}]
["Rennen 4",{"$f":"IF(SUMIF('Rennen 4'!$A$4:$J$13,$A$4,'Rennen 4'!$B$4:$B$13)=0,\"\",SUMIF('Rennen 4'!$A$4:$J$13,$A$4,'Rennen 4'!$B$4:$B$13))","v":""},{"$f":"IF(SUMIF('Rennen 4'!$A$4:$J$13,$A$4,'Rennen 4'!$C$4:$C$13)=0,\"\",SUMIF('Rennen 4'!$A$4:$J$13,$A$4,'Rennen 4'!$C$4:$C$13))","v":""},{"$f":"IF(SUMIF('Rennen 4'!$A$4:$J$13,$A$4,'Rennen 4'!$D$4:$D$13)=0,\"\",SUMIF('Rennen 4'!$A$4:$J$13,$A$4,'Rennen 4'!$D$4:$D$13))","v":""},{"$f":"IF(SUMIF('Rennen 4'!$A$4:$J$13,$A$4,'Rennen 4'!$E$4:$E$13)=0,\"\",SUMIF('Rennen 4'!$A$4:$J$13,$A$4,'Rennen 4'!$E$4:$E$13))","v":""},{"$f":"IF(SUMIF('Rennen 4'!$A$4:$J$13,$A$4,'Rennen 4'!$F$4:$F$13)=0,\"\",SUMIF('Rennen 4'!$A$4:$J$13,$A$4,'Rennen 4'!$F$4:$F$13))","v":""},{"$f":"IF(SUMIF('Rennen 4'!$A$4:$J$13,$A$4,'Rennen 4'!$G$4:$G$13)=0,\"\",SUMIF('Rennen 4'!$A$4:$J$13,$A$4,'Rennen 4'!$G$4:$G$13))","v":""},{"$f":"IF(SUMIF('Rennen 4'!$A$4:$J$13,$A$4,'Rennen 4'!$H$4:$H$13)=0,\"\",SUMIF('Rennen 4'!$A$4:$J$13,$A$4,'Rennen 4'!$H$4:$H$13))","v":10},{"$f":"IF(SUMIF('Rennen 4'!$A$4:$J$13,$A$4,'Rennen 4'!$I$4:$I$13)=0,\"\",SUMIF('Rennen 4'!$A$4:$J$13,$A$4,'Rennen 4'!$I$4:$I$13))","v":""},{"$f":"IF(SUMIF('Rennen 4'!$A$4:$J$13,$A$4,'Rennen 4'!$J$4:$J$13)=0,\"\",SUMIF('Rennen 4'!$A$4:$J$13,$A$4,'Rennen 4'!$J$4:$J$13))","v":""}]
["Rennen 5",{"$f":"IF(SUMIF('Rennen 5'!$A$4:$J$13,$A$4,'Rennen 5'!$B$4:$B$13)=0,\"\",SUMIF('Rennen 5'!$A$4:$J$13,$A$4,'Rennen 5'!$B$4:$B$13))","v":27.063},{"$f":"IF(SUMIF('Rennen 5'!$A$4:$J$13,$A$4,'Rennen 5'!$C$4:$C$13)=0,\"\",SUMIF('Rennen 5'!$A$4:$J$13,$A$4,'Rennen 5'!$C$4:$C$13))","v":49},{"$f":"IF(SUMIF('Rennen 5'!$A$4:$J$13,$A$4,'Rennen 5'!$D$4:$D$13)=0,\"\",SUMIF('Rennen 5'!$A$4:$J$13,$A$4,'Rennen 5'!$D$4:$D$13))","v":27.492},{"$f":"IF(SUMIF('Rennen 5'!$A$4:$J$13,$A$4,'Rennen 5'!$E$4:$E$13)=0,\"\",SUMIF('Rennen 5'!$A$4:$J$13,$A$4,'Rennen 5'!$E$4:$E$13))","v":""},{"$f":"IF(SUMIF('Rennen 5'!$A$4:$J$13,$A$4,'Rennen 5'!$F$4:$F$13)=0,\"\",SUMIF('Rennen 5'!$A$4:$J$13,$A$4,'Rennen 5'!$F$4:$F$13))","v":""},{"$f":"IF(SUMIF('Rennen 5'!$A$4:$J$13,$A$4,'Rennen 5'!$G$4:$G$13)=0,\"\",SUMIF('Rennen 5'!$A$4:$J$13,$A$4,'Rennen 5'!$G$4:$G$13))","v":66},{"$f":"IF(SUMIF('Rennen 5'!$A$4:$J$13,$A$4,'Rennen 5'!$H$4:$H$13)=0,\"\",SUMIF('Rennen 5'!$A$4:$J$13,$A$4,'Rennen 5'!$H$4:$H$13))","v":""},{"$f":"IF(SUMIF('Rennen 5'!$A$4:$J$13,$A$4,'Rennen 5'!$I$4:$I$13)=0,\"\",SUMIF('Rennen 5'!$A$4:$J$13,$A$4,'Rennen 5'!$I$4:$I$13))","v":3},{"$f":"IF(SUMIF('Rennen 5'!$A$4:$J$13,$A$4,'Rennen 5'!$J$4:$J$13)=0,\"\",SUMIF('Rennen 5'!$A$4:$J$13,$A$4,'Rennen 5'!$J$4:$J$13))","v":6}]
["Min",{"$f":"IF(MIN(B6:B10)=0,\"\",MIN(B6:B10))","v":27.04},{"$f":"IF(MIN(C6:C10)=0,\"\",MIN(C6:C10))","v":18},27.492,"00:30:22",40.42,65,10,2]
["Max",{"$f":"IF(MAX(B6:B10)=0,\"\",MAX(B6:B10))","v":27.12},{"$f":"IF(MAX(C6:C10)=0,\"\",MAX(C6:C10))","v":49},28.05,1.6756944444444446,40.75,86,10,4]
[null,null,{"$f":"SUM(C6:C10)","v":142},null,{"$f":"SUM(E6:E10)","v":1.7212847222222225},{"$nulls":4},{"$f":"SUM(J6:J10)","v":24}]

{"sheet":"AUSWERTUNG RENNEN","index":7,"n_rows":66,"n_cols":15,"rows_kept":66}
["Gesamtwertung",{"$nulls":12},"Punktetabelle"]
["Rennen 1",{"$f":"'Rennen 1'!$B$1","v":"2015-04-25"},{"$nulls":10},{"v":10,"d":"10 Platz"},"Anna",{"$f":"SUMIF($A$3:$J$66,N2,$J$3:$J$66)","v":{"v":0,"d":"0 Punkte"}}]
[{"$f":"'Rennen 1'!A3","v":"Name"},{"$f":"'Rennen 1'!B3","v":"Beste \nRundenzeit"},{"$f":"'Rennen 1'!C3","v":"Bestzeit in\nRunde"},{"$f":"'Rennen 1'!D3","v":"Mittlere\nRundenzeit"},{"$f":"'Rennen 1'!E3","v":"Gesamt-\nfahrzeit"},{"$f":"'Rennen 1'!F3","v":"Mittlere\nGeschwindigkeit"},{"$f":"'Rennen 1'!G3","v":"Runden"},{"$f":"'Rennen 1'!H3","v":"Zusatzgewicht"},{"$f":"'Rennen 1'!I3","v":"Platzierung"},{"$f":"'Rennen 1'!J3","v":"Punkte"},null,null,{"v":9,"d":"9 Platz"},"Carlos",{"v":7,"d":"7 Punkte"}]
[{"$f":"IF('Rennen 1'!A4>0,'Rennen 1'!A4,\"\")","v":"Marcel"},{"$f":"'Rennen 1'!B4","v":26.32},{"$f":"'Rennen 1'!C4","v":71},{"$f":"'Rennen 1'!D4","v":26.62},{"$f":"'Rennen 1'!E4","v":"00:35:02"},{"$f":"'Rennen 1'!F4","v":42.61},{"$f":"'Rennen 1'!G4","v":79},{"$f":"'Rennen 1'!H4","v":0},{"$f":"'Rennen 1'!I4","v":1},{"$f":"'Rennen 1'!J4","v":10},null,null,{"v":8,"d":"8 Platz"},"Jens",{"v":8,"d":"8 Punkte"}]
[{"$f":"IF('Rennen 1'!A5>0,'Rennen 1'!A5,\"\")","v":"Sebastian"},{"$f":"'Rennen 1'!B5","v":26.78},{"$f":"'Rennen 1'!C5","v":76},{"$f":"'Rennen 1'!D5","v":27.35},{"$f":"'Rennen 1'!E5","v":"00:35:06"},{"$f":"'Rennen 1'!F5","v":41.46},{"$f":"'Rennen 1'!G5","v":77},{"$f":"'Rennen 1'!H5","v":0},{"$f":"'Rennen 1'!I5","v":2},{"$f":"'Rennen 1'!J5","v":8},null,null,{"v":7,"d":"7 Platz"},"Richard",{"v":9,"d":"9 Punkte"}]
[{"$f":"IF('Rennen 1'!A6>0,'Rennen 1'!A6,\"\")","v":"Thomas"},{"$f":"'Rennen 1'!B6","v":26.82},{"$f":"'Rennen 1'!C6","v":9},{"$f":"'Rennen 1'!D6","v":27.4},{"$f":"'Rennen 1'!E6","v":"00:35:11"},{"$f":"'Rennen 1'!F6","v":41.38},{"$f":"'Rennen 1'!G6","v":77},{"$f":"'Rennen 1'!H6","v":0},{"$f":"'Rennen 1'!I6","v":3},{"$f":"'Rennen 1'!J6","v":6},null,null,{"v":6,"d":"6 Platz"},"Christian",{"v":11,"d":"11 Punkte"}]
[{"$f":"IF('Rennen 1'!A7>0,'Rennen 1'!A7,\"\")","v":"Simon"},{"$f":"'Rennen 1'!B7","v":27.04},{"$f":"'Rennen 1'!C7","v":30},{"$f":"'Rennen 1'!D7","v":27.83},{"$f":"'Rennen 1'!E7","v":"00:35:17"},{"$f":"'Rennen 1'!F7","v":40.75},{"$f":"'Rennen 1'!G7","v":76},{"$f":"'Rennen 1'!H7","v":0},{"$f":"'Rennen 1'!I7","v":4},{"$f":"'Rennen 1'!J7","v":5},null,null,{"v":5,"d":"5 Platz"},"Siegfried",{"v":23,"d":"23 Punkte"}]
[{"$f":"IF('Rennen 1'!A8>0,'Rennen 1'!A8,\"\")","v":"Siegfried"},{"$f":"'Rennen 1'!B8","v":27.19},{"$f":"'Rennen 1'!C8","v":6},{"$f":"'Rennen 1'!D8","v":27.87},{"$f":"'Rennen 1'!E8","v":"00:35:19"},{"$f":"'Rennen 1'!F8","v":40.68},{"$f":"'Rennen 1'!G8","v":76},{"$f":"'Rennen 1'!H8","v":0},{"$f":"'Rennen 1'!I8","v":5},{"$f":"'Rennen 1'!J8","v":4},null,null,{"v":4,"d":"4 Platz"},"Simon",{"v":24,"d":"24 Punkte"}]
[{"$f":"IF('Rennen 1'!A9>0,'Rennen 1'!A9,\"\")","v":"Christian"},{"$f":"'Rennen 1'!B9","v":27.74},{"$f":"'Rennen 1'!C9","v":15},{"$f":"'Rennen 1'!D9","v":28.66},{"$f":"'Rennen 1'!E9","v":"00:35:23"},{"$f":"'Rennen 1'!F9","v":39.57},{"$f":"'Rennen 1'!G9","v":74},{"$f":"'Rennen 1'!H9","v":0},{"$f":"'Rennen 1'!I9","v":6},{"$f":"'Rennen 1'!J9","v":3},null,null,{"v":3,"d":"3 Platz"},"Thomas",{"v":25,"d":"25 Punkte"}]
[{"$f":"IF('Rennen 1'!A10>0,'Rennen 1'!A10,\"\")","v":"Richard"},{"$f":"'Rennen 1'!B10","v":27.97},{"$f":"'Rennen 1'!C10","v":0},{"$f":"'Rennen 1'!D10","v":29.58},{"$f":"'Rennen 1'!E10","v":"00:35:03"},{"$f":"'Rennen 1'!F10","v":38.33},{"$f":"'Rennen 1'!G10","v":71},{"$f":"'Rennen 1'!H10","v":0},{"$f":"'Rennen 1'!I10","v":7},{"$f":"'Rennen 1'!J10","v":2},null,null,{"v":2,"d":"2 Platz"},"Sebastian",{"v":27,"d":"27 Punkte"}]
[{"$f":"IF('Rennen 1'!A11>0,'Rennen 1'!A11,\"\")","v":"Anna"},{"$f":"'Rennen 1'!B11","v":0},{"$f":"'Rennen 1'!C11","v":0},{"$f":"'Rennen 1'!D11","v":0},{"$f":"'Rennen 1'!E11","v":"00:00:00"},{"$f":"'Rennen 1'!F11","v":0},{"$f":"'Rennen 1'!G11","v":0},{"$f":"'Rennen 1'!H11","v":0},{"$f":"'Rennen 1'!I11","v":0},{"$f":"'Rennen 1'!J11","v":0},null,null,{"v":1,"d":"1 Platz"},"Marcel",{"v":40,"d":"40 Punkte"}]
[{"$f":"IF('Rennen 1'!A12>0,'Rennen 1'!A12,\"\")","v":"Carlos"},{"$f":"'Rennen 1'!B12","v":0},{"$f":"'Rennen 1'!C12","v":0},{"$f":"'Rennen 1'!D12","v":0},{"$f":"'Rennen 1'!E12","v":"00:00:00"},{"$f":"'Rennen 1'!F12","v":0},{"$f":"'Rennen 1'!G12","v":0},{"$f":"'Rennen 1'!H12","v":0},{"$f":"'Rennen 1'!I12","v":0},{"$f":"'Rennen 1'!J12","v":0}]
[{"$f":"IF('Rennen 1'!A13>0,'Rennen 1'!A13,\"\")","v":"Jens"},{"$f":"'Rennen 1'!B13","v":0},{"$f":"'Rennen 1'!C13","v":0},{"$f":"'Rennen 1'!D13","v":0},{"$f":"'Rennen 1'!E13","v":"00:00:00"},{"$f":"'Rennen 1'!F13","v":0},{"$f":"'Rennen 1'!G13","v":0},{"$f":"'Rennen 1'!H13","v":0},{"$f":"'Rennen 1'!I13","v":0},{"$f":"'Rennen 1'!J13","v":0}]
[]
[]
["Rennen 2",{"$f":"'Rennen 2'!$B$1","v":"2015-05-30"}]
[{"$f":"'Rennen 2'!A3","v":"Name"},{"$f":"'Rennen 2'!B3","v":"Beste \nRundenzeit"},{"$f":"'Rennen 2'!C3","v":"Bestzeit in\nRunde"},{"$f":"'Rennen 2'!D3","v":"Mittlere\nRundenzeit"},{"$f":"'Rennen 2'!E3","v":"Gesamt-\nfahrzeit"},{"$f":"'Rennen 2'!F3","v":"Mittlere\nGeschwindigkeit"},{"$f":"'Rennen 2'!G3","v":"Runden"},{"$f":"'Rennen 2'!H3","v":"Zusatzgewicht"},{"$f":"'Rennen 2'!I3","v":"Platzierung"},{"$f":"'Rennen 2'!J3","v":"Punkte"}]
[{"$f":"IF('Rennen 2'!A4>0,'Rennen 2'!A4,\"\")","v":"Marcel"},{"$f":"'Rennen 2'!B4","v":26.98},{"$f":"'Rennen 2'!C4","v":63},{"$f":"'Rennen 2'!D4","v":27.28},{"$f":"'Rennen 2'!E4","v":1.6666666666666667},{"$f":"'Rennen 2'!F4","v":41.57},{"$f":"'Rennen 2'!G4","v":88},{"$f":"'Rennen 2'!H4","v":30},{"$f":"'Rennen 2'!I4","v":1},{"$f":"'Rennen 2'!J4","v":10}]
[{"$f":"IF('Rennen 2'!A5>0,'Rennen 2'!A5,\"\")","v":"Sebastian"},{"$f":"'Rennen 2'!B5","v":27.49},{"$f":"'Rennen 2'!C5","v":5},{"$f":"'Rennen 2'!D5","v":28.05},{"$f":"'Rennen 2'!E5","v":1.6756944444444446},{"$f":"'Rennen 2'!F5","v":40.43},{"$f":"'Rennen 2'!G5","v":86},{"$f":"'Rennen 2'!H5","v":20},{"$f":"'Rennen 2'!I5","v":3},{"$f":"'Rennen 2'!J5","v":6}]
[{"$f":"IF('Rennen 2'!A6>0,'Rennen 2'!A6,\"\")","v":"Thomas"},{"$f":"'Rennen 2'!B6","v":26.94},{"$f":"'Rennen 2'!C6","v":62},{"$f":"'Rennen 2'!D6","v":27.4},{"$f":"'Rennen 2'!E6","v":1.6756944444444446},{"$f":"'Rennen 2'!F6","v":41.39},{"$f":"'Rennen 2'!G6","v":88},{"$f":"'Rennen 2'!H6","v":10},{"$f":"'Rennen 2'!I6","v":2},{"$f":"'Rennen 2'!J6","v":8}]
[{"$f":"IF('Rennen 2'!A7>0,'Rennen 2'!A7,\"\")","v":"Simon"},{"$f":"'Rennen 2'!B7","v":27.12},{"$f":"'Rennen 2'!C7","v":18},{"$f":"'Rennen 2'!D7","v":28.05},{"$f":"'Rennen 2'!E7","v":1.6756944444444446},{"$f":"'Rennen 2'!F7","v":40.42},{"$f":"'Rennen 2'!G7","v":86},{"$f":"'Rennen 2'!H7","v":0},{"$f":"'Rennen 2'!I7","v":4},{"$f":"'Rennen 2'!J7","v":5}]
[{"$f":"IF('Rennen 2'!A8>0,'Rennen 2'!A8,\"\")","v":"Siegfried"},{"$f":"'Rennen 2'!B8","v":27.29},{"$f":"'Rennen 2'!C8","v":46},{"$f":"'Rennen 2'!D8","v":28.06},{"$f":"'Rennen 2'!E8","v":1.676388888888889},{"$f":"'Rennen 2'!F8","v":40.42},{"$f":"'Rennen 2'!G8","v":86},{"$f":"'Rennen 2'!H8","v":0},{"$f":"'Rennen 2'!I8","v":"S5"},{"$f":"'Rennen 2'!J8","v":0}]
[{"$f":"IF('Rennen 2'!A9>0,'Rennen 2'!A9,\"\")","v":"Christian"},{"$f":"'Rennen 2'!B9","v":27.68},{"$f":"'Rennen 2'!C9","v":8},{"$f":"'Rennen 2'!D9","v":28.59},{"$f":"'Rennen 2'!E9","v":1.66875},{"$f":"'Rennen 2'!F9","v":39.67},{"$f":"'Rennen 2'!G9","v":84},{"$f":"'Rennen 2'!H9","v":0},{"$f":"'Rennen 2'!I9","v":7},{"$f":"'Rennen 2'!J9","v":2}]
[{"$f":"IF('Rennen 2'!A10>0,'Rennen 2'!A10,\"\")","v":"Richard"},{"$f":"'Rennen 2'!B10","v":27.81},{"$f":"'Rennen 2'!C10","v":7},{"$f":"'Rennen 2'!D10","v":28.74},{"$f":"'Rennen 2'!E10","v":1.6791666666666665},{"$f":"'Rennen 2'!F10","v":39.46},{"$f":"'Rennen 2'!G10","v":84},{"$f":"'Rennen 2'!H10","v":0},{"$f":"'Rennen 2'!I10","v":-9},{"$f":"'Rennen 2'!J10","v":0}]
[{"$f":"IF('Rennen 2'!A11>0,'Rennen 2'!A11,\"\")","v":"Anna"},{"$f":"'Rennen 2'!B11","v":27.92},{"$f":"'Rennen 2'!C11","v":21},{"$f":"'Rennen 2'!D11","v":29.53},{"$f":"'Rennen 2'!E11","v":1.6013888888888888},{"$f":"'Rennen 2'!F11","v":38.4},{"$f":"'Rennen 2'!G11","v":78},{"$f":"'Rennen 2'!H11","v":0},{"$f":"'Rennen 2'!I11","v":10},{"$f":"'Rennen 2'!J11","v":0}]
[{"$f":"IF('Rennen 2'!A12>0,'Rennen 2'!A12,\"\")","v":"Carlos"},{"$f":"'Rennen 2'!B12","v":27.6},{"$f":"'Rennen 2'!C12","v":69},{"$f":"'Rennen 2'!D12","v":0},{"$f":"'Rennen 2'!E12","v":1.6743055555555555},{"$f":"'Rennen 2'!F12","v":39.56},{"$f":"'Rennen 2'!G12","v":84},{"$f":"'Rennen 2'!H12","v":0},{"$f":"'Rennen 2'!I12","v":8},{"$f":"'Rennen 2'!J12","v":1}]
[{"$f":"IF('Rennen 2'!A13>0,'Rennen 2'!A13,\"\")","v":"Jens"},{"$f":"'Rennen 2'!B13","v":27.32},{"$f":"'Rennen 2'!C13","v":23},{"$f":"'Rennen 2'!D13","v":28.58},{"$f":"'Rennen 2'!E13","v":1.6881944444444443},{"$f":"'Rennen 2'!F13","v":39.68},{"$f":"'Rennen 2'!G13","v":85},{"$f":"'Rennen 2'!H13","v":0},{"$f":"'Rennen 2'!I13","v":6},{"$f":"'Rennen 2'!J13","v":3}]
[]
["Rennen 3",{"$f":"'Rennen 3'!$B$1","v":"2015-06-20"}]
[{"$f":"'Rennen 3'!A4","v":"Marcel"},{"$f":"'Rennen 3'!B4","v":27.07},{"$f":"'Rennen 3'!C4","v":33},{"$f":"'Rennen 3'!D4","v":28},{"$f":"'Rennen 3'!E4","v":"00:30:20"},{"$f":"'Rennen 3'!F4","v":40.5},{"$f":"'Rennen 3'!G4","v":65},{"$f":"'Rennen 3'!H4","v":30},{"$f":"'Rennen 3'!I4","v":1},{"$f":"'Rennen 3'!J4","v":10}]
[{"$f":"'Rennen 3'!A5","v":"Sebastian"},{"$f":"'Rennen 3'!B5","v":27.16},{"$f":"'Rennen 3'!C5","v":55},{"$f":"'Rennen 3'!D5","v":28.1},{"$f":"'Rennen 3'!E5","v":"00:30:28"},{"$f":"'Rennen 3'!F5","v":40.35},{"$f":"'Rennen 3'!G5","v":65},{"$f":"'Rennen 3'!H5","v":20},{"$f":"'Rennen 3'!I5","v":4},{"$f":"'Rennen 3'!J5","v":5}]
[{"$f":"'Rennen 3'!A6","v":"Thomas"},{"$f":"'Rennen 3'!B6","v":27.24},{"$f":"'Rennen 3'!C6","v":24},{"$f":"'Rennen 3'!D6","v":28.1},{"$f":"'Rennen 3'!E6","v":"00:30:28"},{"$f":"'Rennen 3'!F6","v":40.63},{"$f":"'Rennen 3'!G6","v":65},{"$f":"'Rennen 3'!H6","v":20},{"$f":"'Rennen 3'!I6","v":-5},{"$f":"'Rennen 3'!J6","v":0}]
[{"$f":"'Rennen 3'!A7","v":"Simon"},{"$f":"'Rennen 3'!B7","v":27.04},{"$f":"'Rennen 3'!C7","v":45},{"$f":"'Rennen 3'!D7","v":28.02},{"$f":"'Rennen 3'!E7","v":"00:30:22"},{"$f":"'Rennen 3'!F7","v":40.47},{"$f":"'Rennen 3'!G7","v":65},{"$f":"'Rennen 3'!H7","v":0},{"$f":"'Rennen 3'!I7","v":2},{"$f":"'Rennen 3'!J7","v":8}]
[{"$f":"'Rennen 3'!A8","v":"Siegfried"},{"$f":"'Rennen 3'!B8","v":26.89},{"$f":"'Rennen 3'!C8","v":19},{"$f":"'Rennen 3'!D8","v":28.02},{"$f":"'Rennen 3'!E8","v":"00:30:22"},{"$f":"'Rennen 3'!F8","v":40.47},{"$f":"'Rennen 3'!G8","v":65},{"$f":"'Rennen 3'!H8","v":0},{"$f":"'Rennen 3'!I8","v":3},{"$f":"'Rennen 3'!J8","v":6}]
[{"$f":"'Rennen 3'!A9","v":"Christian"},{"$f":"'Rennen 3'!B9","v":27.81},{"$f":"'Rennen 3'!C9","v":42},{"$f":"'Rennen 3'!D9","v":28.93},{"$f":"'Rennen 3'!E9","v":"00:30:25"},{"$f":"'Rennen 3'!F9","v":39.25},{"$f":"'Rennen 3'!G9","v":63},{"$f":"'Rennen 3'!H9","v":0},{"$f":"'Rennen 3'!I9","v":7},{"$f":"'Rennen 3'!J9","v":2}]
[{"$f":"'Rennen 3'!A10","v":"Richard"},{"$f":"'Rennen 3'!B10","v":27.78},{"$f":"'Rennen 3'!C10","v":35},{"$f":"'Rennen 3'!D10","v":29.16},{"$f":"'Rennen 3'!E10","v":"00:30:40"},{"$f":"'Rennen 3'!F10","v":38.88},{"$f":"'Rennen 3'!G10","v":63},{"$f":"'Rennen 3'!H10","v":0},{"$f":"'Rennen 3'!I10","v":8},{"$f":"'Rennen 3'!J10","v":1}]
[{"$f":"'Rennen 3'!A11","v":"Anna"},{"$f":"'Rennen 3'!B11","v":0},{"$f":"'Rennen 3'!C11","v":0},{"$f":"'Rennen 3'!D11","v":0},{"$f":"'Rennen 3'!E11","v":"00:00:00"},{"$f":"'Rennen 3'!F11","v":0},{"$f":"'Rennen 3'!G11","v":0},{"$f":"'Rennen 3'!H11","v":0},{"$f":"'Rennen 3'!I11","v":0},{"$f":"'Rennen 3'!J11","v":0}]
[{"$f":"'Rennen 3'!A12","v":"Carlos"},{"$f":"'Rennen 3'!B12","v":0},{"$f":"'Rennen 3'!C12","v":0},{"$f":"'Rennen 3'!D12","v":0},{"$f":"'Rennen 3'!E12","v":"00:00:00"},{"$f":"'Rennen 3'!F12","v":0},{"$f":"'Rennen 3'!G12","v":0},{"$f":"'Rennen 3'!H12","v":0},{"$f":"'Rennen 3'!I12","v":0},{"$f":"'Rennen 3'!J12","v":0}]
[{"$f":"'Rennen 3'!A13","v":"Jens"},{"$f":"'Rennen 3'!B13","v":27.45},{"$f":"'Rennen 3'!C13","v":64},{"$f":"'Rennen 3'!D13","v":28.5},{"$f":"'Rennen 3'!E13","v":"00:30:26"},{"$f":"'Rennen 3'!F13","v":39.79},{"$f":"'Rennen 3'!G13","v":64},{"$f":"'Rennen 3'!H13","v":0},{"$f":"'Rennen 3'!I13","v":6},{"$f":"'Rennen 3'!J13","v":3}]
[]
[]
["Rennen 4",{"$f":"'Rennen 4'!$B$1","v":"2015-09-26"}]
[{"$f":"'Rennen 4'!A4","v":"Marcel"},{"$f":"'Rennen 4'!B4","v":26.99},{"$f":"'Rennen 4'!C4","v":60},{"$f":"'Rennen 4'!D4","v":27.25},{"$f":"'Rennen 4'!E4","v":"00:35:26"},{"$f":"'Rennen 4'!F4","v":41.61},{"$f":"'Rennen 4'!G4","v":78},{"$f":"'Rennen 4'!H4","v":30},{"$f":"'Rennen 4'!I4","v":1},{"$f":"'Rennen 4'!J4","v":10}]
[{"$f":"'Rennen 4'!A5","v":"Sebastian"},{"$f":"'Rennen 4'!B5","v":27.15},{"$f":"'Rennen 4'!C5","v":51},{"$f":"'Rennen 4'!D5","v":27.55},{"$f":"'Rennen 4'!E5","v":"00:35:49"},{"$f":"'Rennen 4'!F5","v":41.16},{"$f":"'Rennen 4'!G5","v":78},{"$f":"'Rennen 4'!H5","v":20},{"$f":"'Rennen 4'!I5","v":2},{"$f":"'Rennen 4'!J5","v":8}]
[{"$f":"'Rennen 4'!A6","v":"Thomas"},{"$f":"'Rennen 4'!B6","v":27.09},{"$f":"'Rennen 4'!C6","v":37},{"$f":"'Rennen 4'!D6","v":27.54},{"$f":"'Rennen 4'!E6","v":"00:35:50"},{"$f":"'Rennen 4'!F6","v":41.18},{"$f":"'Rennen 4'!G6","v":78},{"$f":"'Rennen 4'!H6","v":10},{"$f":"'Rennen 4'!I6","v":3},{"$f":"'Rennen 4'!J6","v":6}]
[{"$f":"'Rennen 4'!A7","v":"Simon"},{"$f":"'Rennen 4'!B7","v":0},{"$f":"'Rennen 4'!C7","v":0},{"$f":"'Rennen 4'!D7","v":0},{"$f":"'Rennen 4'!E7","v":"00:00:00"},{"$f":"'Rennen 4'!F7","v":0},{"$f":"'Rennen 4'!G7","v":0},{"$f":"'Rennen 4'!H7","v":10},{"$f":"'Rennen 4'!I7","v":0},{"$f":"'Rennen 4'!J7","v":0}]
[{"$f":"'Rennen 4'!A8","v":"Siegfried"},{"$f":"'Rennen 4'!B8","v":27.37},{"$f":"'Rennen 4'!C8","v":22},{"$f":"'Rennen 4'!D8","v":27.79},{"$f":"'Rennen 4'!E8","v":"00:35:42"},{"$f":"'Rennen 4'!F8","v":40.81},{"$f":"'Rennen 4'!G8","v":77},{"$f":"'Rennen 4'!H8","v":0},{"$f":"'Rennen 4'!I8","v":4},{"$f":"'Rennen 4'!J8","v":5}]
[{"$f":"'Rennen 4'!A9","v":"Christian"},{"$f":"'Rennen 4'!B9","v":27.72},{"$f":"'Rennen 4'!C9","v":24},{"$f":"'Rennen 4'!D9","v":28.22},{"$f":"'Rennen 4'!E9","v":"00:35:48"},{"$f":"'Rennen 4'!F9","v":40.18},{"$f":"'Rennen 4'!G9","v":76},{"$f":"'Rennen 4'!H9","v":0},{"$f":"'Rennen 4'!I9","v":5},{"$f":"'Rennen 4'!J9","v":4}]
[{"$f":"'Rennen 4'!A10","v":"Richard"},{"$f":"'Rennen 4'!B10","v":27.86},{"$f":"'Rennen 4'!C10","v":64},{"$f":"'Rennen 4'!D10","v":28.77},{"$f":"'Rennen 4'!E10","v":"00:35:30"},{"$f":"'Rennen 4'!F10","v":39.41},{"$f":"'Rennen 4'!G10","v":74},{"$f":"'Rennen 4'!H10","v":0},{"$f":"'Rennen 4'!I10","v":7},{"$f":"'Rennen 4'!J10","v":2}]
[{"$f":"'Rennen 4'!A11","v":"Anna"},{"$f":"'Rennen 4'!B11","v":0},{"$f":"'Rennen 4'!C11","v":0},{"$f":"'Rennen 4'!D11","v":0},{"$f":"'Rennen 4'!E11","v":"00:00:00"},{"$f":"'Rennen 4'!F11","v":0},{"$f":"'Rennen 4'!G11","v":0},{"$f":"'Rennen 4'!H11","v":0},{"$f":"'Rennen 4'!I11","v":0},{"$f":"'Rennen 4'!J11","v":0}]
[{"$f":"'Rennen 4'!A12","v":"Carlos"},{"$f":"'Rennen 4'!B12","v":27.72},{"$f":"'Rennen 4'!C12","v":54},{"$f":"'Rennen 4'!D12","v":28.57},{"$f":"'Rennen 4'!E12","v":"00:35:45"},{"$f":"'Rennen 4'!F12","v":39.7},{"$f":"'Rennen 4'!G12","v":75},{"$f":"'Rennen 4'!H12","v":0},{"$f":"'Rennen 4'!I12","v":6},{"$f":"'Rennen 4'!J12","v":3}]
[{"$f":"'Rennen 4'!A13","v":"Jens"},{"$f":"'Rennen 4'!B13","v":0},{"$f":"'Rennen 4'!C13","v":0},{"$f":"'Rennen 4'!D13","v":0},{"$f":"'Rennen 4'!E13","v":"00:00:00"},{"$f":"'Rennen 4'!F13","v":0},{"$f":"'Rennen 4'!G13","v":0},{"$f":"'Rennen 4'!H13","v":0},{"$f":"'Rennen 4'!I13","v":0},{"$f":"'Rennen 4'!J13","v":0}]
[]
[]
["Rennen 5",{"$f":"'Rennen 5'!$B$1","v":"2015-10-24"}]
[{"$f":"'Rennen 5'!A4","v":"Marcel"},{"$f":"'Rennen 5'!B4","v":27.078},{"$f":"'Rennen 5'!C4","v":55},{"$f":"'Rennen 5'!D4","v":27.302},{"$f":"'Rennen 5'!E4","v":"00:00:00"},{"$f":"'Rennen 5'!F4","v":0},{"$f":"'Rennen 5'!G4","v":66},{"$f":"'Rennen 5'!H4","v":30},{"$f":"'Rennen 5'!I4","v":-1},{"$f":"'Rennen 5'!J4","v":0}]
[{"$f":"'Rennen 5'!A5","v":"Sebastian"},{"$f":"'Rennen 5'!B5","v":0},{"$f":"'Rennen 5'!C5","v":0},{"$f":"'Rennen 5'!D5","v":0},{"$f":"'Rennen 5'!E5","v":"00:00:00"},{"$f":"'Rennen 5'!F5","v":0},{"$f":"'Rennen 5'!G5","v":0},{"$f":"'Rennen 5'!H5","v":20},{"$f":"'Rennen 5'!I5","v":0},{"$f":"'Rennen 5'!J5","v":0}]
[{"$f":"'Rennen 5'!A6","v":"Thomas"},{"$f":"'Rennen 5'!B6","v":27.323},{"$f":"'Rennen 5'!C6","v":46},{"$f":"'Rennen 5'!D6","v":27.61},{"$f":"'Rennen 5'!E6","v":"00:00:00"},{"$f":"'Rennen 5'!F6","v":0},{"$f":"'Rennen 5'!G6","v":66},{"$f":"'Rennen 5'!H6","v":10},{"$f":"'Rennen 5'!I6","v":4},{"$f":"'Rennen 5'!J6","v":5}]
[{"$f":"'Rennen 5'!A7","v":"Simon"},{"$f":"'Rennen 5'!B7","v":27.063},{"$f":"'Rennen 5'!C7","v":49},{"$f":"'Rennen 5'!D7","v":27.492},{"$f":"'Rennen 5'!E7","v":"00:00:00"},{"$f":"'Rennen 5'!F7","v":0},{"$f":"'Rennen 5'!G7","v":66},{"$f":"'Rennen 5'!H7","v":0},{"$f":"'Rennen 5'!I7","v":3},{"$f":"'Rennen 5'!J7","v":6}]
[{"$f":"'Rennen 5'!A8","v":"Siegfried"},{"$f":"'Rennen 5'!B8","v":27.194},{"$f":"'Rennen 5'!C8","v":60},{"$f":"'Rennen 5'!D8","v":27.484},{"$f":"'Rennen 5'!E8","v":"00:00:00"},{"$f":"'Rennen 5'!F8","v":0},{"$f":"'Rennen 5'!G8","v":66},{"$f":"'Rennen 5'!H8","v":0},{"$f":"'Rennen 5'!I8","v":2},{"$f":"'Rennen 5'!J8","v":8}]
[{"$f":"'Rennen 5'!A9","v":"Christian"},{"$f":"'Rennen 5'!B9","v":27.641},{"$f":"'Rennen 5'!C9","v":50},{"$f":"'Rennen 5'!D9","v":28.063},{"$f":"'Rennen 5'!E9","v":"00:00:00"},{"$f":"'Rennen 5'!F9","v":0},{"$f":"'Rennen 5'!G9","v":64},{"$f":"'Rennen 5'!H9","v":0},{"$f":"'Rennen 5'!I9","v":-8},{"$f":"'Rennen 5'!J9","v":0}]
[{"$f":"'Rennen 5'!A10","v":"Richard"},{"$f":"'Rennen 5'!B10","v":27.441},{"$f":"'Rennen 5'!C10","v":30},{"$f":"'Rennen 5'!D10","v":27.881},{"$f":"'Rennen 5'!E10","v":"00:00:00"},{"$f":"'Rennen 5'!F10","v":0},{"$f":"'Rennen 5'!G10","v":65},{"$f":"'Rennen 5'!H10","v":0},{"$f":"'Rennen 5'!I10","v":5},{"$f":"'Rennen 5'!J10","v":4}]
[{"$f":"'Rennen 5'!A11","v":"Anna"},{"$f":"'Rennen 5'!B11","v":28.02},{"$f":"'Rennen 5'!C11","v":11},{"$f":"'Rennen 5'!D11","v":29.703},{"$f":"'Rennen 5'!E11","v":"00:00:00"},{"$f":"'Rennen 5'!F11","v":0},{"$f":"'Rennen 5'!G11","v":51},{"$f":"'Rennen 5'!H11","v":0},{"$f":"'Rennen 5'!I11","v":9},{"$f":"'Rennen 5'!J11","v":0}]
[{"$f":"'Rennen 5'!A12","v":"Carlos"},{"$f":"'Rennen 5'!B12","v":27.54},{"$f":"'Rennen 5'!C12","v":42},{"$f":"'Rennen 5'!D12","v":28.038},{"$f":"'Rennen 5'!E12","v":"00:00:00"},{"$f":"'Rennen 5'!F12","v":0},{"$f":"'Rennen 5'!G12","v":65},{"$f":"'Rennen 5'!H12","v":0},{"$f":"'Rennen 5'!I12","v":6},{"$f":"'Rennen 5'!J12","v":3}]
[{"$f":"'Rennen 5'!A13","v":"Jens"},{"$f":"'Rennen 5'!B13","v":27.49},{"$f":"'Rennen 5'!C13","v":64},{"$f":"'Rennen 5'!D13","v":27.969},{"$f":"'Rennen 5'!E13","v":"00:00:00"},{"$f":"'Rennen 5'!F13","v":0},{"$f":"'Rennen 5'!G13","v":64},{"$f":"'Rennen 5'!H13","v":0},{"$f":"'Rennen 5'!I13","v":7},{"$f":"'Rennen 5'!J13","v":2}]
[{"$f":"'Rennen 5'!A52","v":0},{"$f":"'Rennen 5'!B52","v":0},{"$f":"'Rennen 5'!C52","v":0},{"$f":"'Rennen 5'!D52","v":0},{"$f":"'Rennen 5'!E52","v":"00:00:00"},{"$f":"'Rennen 5'!F52","v":0},{"$f":"'Rennen 5'!G52","v":0},{"$f":"'Rennen 5'!H52","v":0},{"$f":"'Rennen 5'!I52","v":0},{"$f":"'Rennen 5'!J52","v":0}]